Target
Serine/threonine-protein kinase pim-3
Ligand
BDBM50460939
Substrate
Meas. Tech.
ChEMBL_1770565 (CHEMBL4222677)
IC50
<3.0±n/a nM
Citation
 Gingipalli, LBlock, MHBao, LCooke, EDakin, LADenz, CRFerguson, ADJohannes, JWLarsen, NALyne, PDPontz, TWWang, TWu, XWu, AZhang, HJZheng, XDowling, JELamb, ML Discovery of 2,6-disubstituted pyrazine derivatives as inhibitors of CK2 and PIM kinases. Bioorg Med Chem Lett 28:1336-1341 (2018)  
Target
Name:
Serine/threonine-protein kinase pim-3
Synonyms:
PIM3 Serine/threonine-protein kinase pim-3 (PIM3)
Type:
Protein
Mol. Mass.:
35888.19
Organism:
Homo sapiens (Human)
Description:
Q86V86
Residue:
326
  
Inhibitor
Name:
BDBM50460939
Synonyms:
CHEMBL4228654
Type:
Small organic molecule
Emp. Form.:
C21H19N5O2
Mol. Mass.:
373.4079
SMILES:
CC(C)Nc1ccc2cnn(-c3cncc(n3)-c3ccc(cc3)C(O)=O)c2c1
: