Target
Protein mono-ADP-ribosyltransferase PARP14
Ligand
BDBM50460985
Substrate
Meas. Tech.
ChEMBL_1770603 (CHEMBL4222715)
IC50
1200±n/a nM
Citation
 Moustakim, MRiedel, KSchuller, MGehring, APMonteiro, OPMartin, SPFedorov, OHeer, JDixon, DJElkins, JMKnapp, SBracher, FBrennan, PE Discovery of a novel allosteric inhibitor scaffold for polyadenosine-diphosphate-ribose polymerase 14 (PARP14) macrodomain 2. Bioorg Med Chem 26:2965-2972 (2018)  
Target
Name:
Protein mono-ADP-ribosyltransferase PARP14
Synonyms:
(ARTD8 or PARP14) 2.4.2.- ADP-ribosyltransferase diphtheria toxin-like 8 B aggressive lymphoma protein 2 BAL2  KIAA1268 PAR14_HUMAN PARP14 Synonyms=BAL2
Type:
Mol. Mass.:
202812.41
Organism:
Homo sapiens (Human)
Description:
Q460N5
Residue:
1801
  
Inhibitor
Name:
BDBM50460985
Synonyms:
CHEMBL4227446
Type:
Small organic molecule
Emp. Form.:
C20H18N2O2S
Mol. Mass.:
350.434
SMILES:
CCS(=O)(=O)Nc1ccccc1-c1cccc2c1[nH]c1ccccc21
: