Target
Nuclear receptor ROR-gamma
Ligand
BDBM50461067
Substrate
Meas. Tech.
ChEMBL_1770666 (CHEMBL4222778)
IC50
97±n/a nM
Citation
 Ouvry, GBihl, FBouix-Peter, CChristin, ODefoin-Platel, CDeret, SFeret, CFroude, DHacini-Rachinel, FHarris, CSHervouet, CLafitte, GLuzy, APMusicki, BOrfila, DParnet, VPascau, CPascau, JPierre, RRaffin, CRossio, PSpiesse, DTaquet, NThoreau, EVatinel, RVial, EHennequin, LF Sulfoximines as potent ROR? inverse agonists. Bioorg Med Chem Lett 28:1269-1273 (2018)  
Target
Name:
Nuclear receptor ROR-gamma
Synonyms:
NR1F3 Nuclear receptor ROR-gamma (RORC) RAR-related orphan receptor C (RORc) RORG RZRG Retinoid-related orphan receptor-gamma (RORc)
Type:
Enzyme Catalytic Domain
Mol. Mass.:
58218.40
Organism:
Homo sapiens (Human)
Description:
P51449
Residue:
518
  
Inhibitor
Name:
BDBM50461067
Synonyms:
CHEMBL4224870
Type:
Small organic molecule
Emp. Form.:
C25H35NO5S2
Mol. Mass.:
493.679
SMILES:
CCc1ccc(cc1)N(CC(C)C)S(=O)(=O)c1ccc(OCC2CCOCC2)c(c1)[S+](C)[O-]
: