Target
Gamma-hydroxybutyrate receptor
Ligand
BDBM50023575
Substrate
Meas. Tech.
ChEBML_68885
IC50
6600±n/a nM
Citation
 Bourguignon, JJSchoenfelder, ASchmitt, MWermuth, CGHechler, VCharlier, BMaitre, M Analogues of gamma-hydroxybutyric acid. Synthesis and binding studies. J Med Chem 31:893-7 (1988)  
Target
Name:
Gamma-hydroxybutyrate receptor
Synonyms:
Gamma hydroxybutyric, GHB | Gamma-hydroxybutyrate receptor
Type:
Enzyme Catalytic Domain
Mol. Mass.:
56171.11
Organism:
RAT
Description:
Gamma hydroxybutyric, GHB 0 RAT::Q6RY99
Residue:
512
  
Inhibitor
Name:
BDBM50023575
Synonyms:
4-hydroxy-butyric acid 4-hydroxybutyric acid GHB Xyrem | gamma-hydroxybutyric acid
Type:
Small organic molecule
Emp. Form.:
C4H8O3
Mol. Mass.:
104.1045
SMILES:
OCCCC(O)=O
: