Target
Gag-Pol polyprotein
Ligand
BDBM50461431
Substrate
Meas. Tech.
ChEMBL_1771313 (CHEMBL4223425)
IC50
0.420000±n/a nM
Citation
 Chen, YSit, SYChen, JSwidorski, JJLiu, ZSin, NVenables, BLParker, DDNowicka-Sans, BLin, ZLi, ZTerry, BJProtack, TRahematpura, SHanumegowda, UJenkins, SKrystal, MDicker, IDMeanwell, NARegueiro-Ren, A The design, synthesis and structure-activity relationships associated with C28 amine-based betulinic acid derivatives as inhibitors of HIV-1 maturation. Bioorg Med Chem Lett 28:1550-1557 (2018)  
Target
Name:
Gag-Pol polyprotein
Synonyms:
HIV-1 reverse transcriptase (HIV-1 RT) POL_HV1H2 Protease Reverse transcriptase (RT) gag-pol p66 RT
Type:
Protein
Mol. Mass.:
162074.74
Organism:
Human immunodeficiency virus type 1 group M subtype B (isolate HXB2)
Description:
P04585
Residue:
1435
  
Inhibitor
Name:
BDBM50461431
Synonyms:
CHEMBL4228517
Type:
Small organic molecule
Emp. Form.:
C41H62N2O3
Mol. Mass.:
630.9426
SMILES:
[H][C@]12[C@@H](CC[C@]1(CNCCNCCO)CC[C@]1(C)[C@]2([H])CC[C@]2([H])[C@@]3(C)CC=C(c4ccc(cc4)C(O)=O)C(C)(C)[C@]3([H])CC[C@@]12C)C(C)=C
: