Target
Acetyl-CoA carboxylase 2
Ligand
BDBM50462060
Substrate
Meas. Tech.
ChEMBL_1772531 (CHEMBL4224643)
IC50
2.1±n/a nM
Citation
 Nishiura, YMatsumura, AKobayashi, NShimazaki, ASakamoto, SKitade, NTonomura, YIno, AOkuno, T Discovery of a novel olefin derivative as a highly potent and selective acetyl-CoA carboxylase 2 inhibitor with in vivo efficacy. Bioorg Med Chem Lett 28:2498-2503 (2018)  
Target
Name:
Acetyl-CoA carboxylase 2
Synonyms:
ACACB ACC-beta ACCB Acetyl-CoA carboxylase 2 Acetyl-CoA carboxylase 2 (ACC2)
Type:
Protein
Mol. Mass.:
276535.21
Organism:
Homo sapiens (Human)
Description:
O00763
Residue:
2458
  
Inhibitor
Name:
BDBM50462060
Synonyms:
CHEMBL4229067
Type:
Small organic molecule
Emp. Form.:
C21H22FN3O2S
Mol. Mass.:
399.482
SMILES:
C[C@H](NC(C)=O)\C=C\c1ccc(Oc2ccc3nc(sc3c2F)C(C)C)nc1
: