Target
14-3-3 protein sigma
Ligand
BDBM50462080
Substrate
Meas. Tech.
ChEMBL_1772676 (CHEMBL4229668)
IC50
2600±n/a nM
Citation
 Stevers, LMSijbesma, EBotta, MMacKintosh, CObsil, TLandrieu, ICau, YWilson, AJKarawajczyk, AEickhoff, JDavis, JHann, MO'Mahony, GDoveston, RGBrunsveld, LOttmann, C Modulators of 14-3-3 Protein-Protein Interactions. J Med Chem 61:3755-3778 (2018)  
Target
Name:
14-3-3 protein sigma
Synonyms:
1433S_HUMAN HME1 Stratifin
Type:
PROTEIN
Mol. Mass.:
27757.12
Organism:
Homo sapiens (Human)
Description:
ChEMBL_775356
Residue:
248
  
Inhibitor
Name:
BDBM50462080
Synonyms:
CHEMBL4250552
Type:
Small organic molecule
Emp. Form.:
C20H23N6O8P
Mol. Mass.:
506.4058
SMILES:
Oc1ccc(CCNC(=O)[C@H](COP(O)(O)=O)NC(=O)CNC(=O)c2ccc(cc2)N=[N+]=[N-])cc1
: