Target
Beta-1 adrenergic receptor
Ligand
BDBM50462282
Substrate
Meas. Tech.
ChEMBL_1774536 (CHEMBL4231528)
EC50
2.9±n/a nM
Citation
 Jin, JMiao, CWang, ZZhang, WZhang, XXie, XLu, W Design and synthesis of aryloxypropanolamine as ? Eur J Med Chem 150:757-770 (2018)  
Target
Name:
Beta-1 adrenergic receptor
Synonyms:
ADRB1 ADRB1_HUMAN Beta-1 adrenoceptor | adrenergic Beta1
Type:
G Protein-Coupled Receptor (GPCR)
Mol. Mass.:
51338.40
Organism:
Homo sapiens (Human)
Description:
P08588
Residue:
477
  
Inhibitor
Name:
BDBM50462282
Synonyms:
CHEMBL4249564
Type:
Small organic molecule
Emp. Form.:
C26H28N4O3
Mol. Mass.:
444.5255
SMILES:
O[C@@H](CNCCc1ccc(NC(=O)Nc2ccccc2)cc1)COc1cccc2[nH]ccc12
: