Target
Aldo-keto reductase family 1 member C3
Ligand
BDBM50277998
Substrate
Meas. Tech.
ChEMBL_1774821 (CHEMBL4231813)
IC50
310±n/a nM
Citation
 Pippione, ACCarnovale, IMBonanni, DSini, MGoyal, PMarini, EPors, KAdinolfi, SZonari, DFestuccia, CWahlgren, WYFriemann, RBagnati, RBoschi, DOliaro-Bosso, SLolli, ML Potent and selective aldo-keto reductase 1C3 (AKR1C3) inhibitors based on the benzoisoxazole moiety: application of a bioisosteric scaffold hopping approach to flufenamic acid. Eur J Med Chem 150:930-945 (2018)  
Target
Name:
Aldo-keto reductase family 1 member C3
Synonyms:
17-beta-Hydroxysteroid Dehydrogenase 5 (17-beta-HSD5, AKR1C3) AK1C3_HUMAN Aldo-keto reductase family 1 member C3 Aldo-keto reductase family 1 member C3 (AK1C3a) Aldo-keto-reductase family 1 member C3 Dihydrodiol dehydrogenase 3 Estradiol 17-beta-dehydrogenase KIAA0119 Prostaglandin F synthase Trans-1,2-dihydrobenzene-1,2-diol dehydrogenase
Type:
Enzyme
Mol. Mass.:
36859.86
Organism:
Homo sapiens (Human)
Description:
P42330
Residue:
323
  
Inhibitor
Name:
BDBM50277998
Synonyms:
CHEMBL4174786
Type:
Small organic molecule
Emp. Form.:
C18H15F3N4O3
Mol. Mass.:
392.3319
SMILES:
COc1ccc(Cn2nnc(O)c2C(=O)Nc2cccc(c2)C(F)(F)F)cc1
: