Target
Acetylcholinesterase
Ligand
BDBM50044549
Substrate
Meas. Tech.
ChEMBL_1775686 (CHEMBL4232678)
Kd
0.000±n/a nM
Citation
 Unver, MYGierse, RMRitchie, HHirsch, AKH Druggability Assessment of Targets Used in Kinetic Target-Guided Synthesis. J Med Chem 61:9395-9409 (2018)  
Target
Name:
Acetylcholinesterase
Synonyms:
ACES_ELEEL Acetylcholinesterase (EeAChE) | ache
Type:
Enzyme
Mol. Mass.:
71812.79
Organism:
Electrophorus electricus (Electric eel)
Description:
Residue:
633
  
Inhibitor
Name:
BDBM50044549
Synonyms:
CHEMBL3314093
Type:
Small organic molecule
Emp. Form.:
C40H48N6O2
Mol. Mass.:
644.8481
SMILES:
COc1cc2CCN(CCCCCCc3cnnn3CCNc3c4CCCCc4nc4ccccc34)[C@H](c3ccccc3)c2cc1OC
: