Target
Acetylcholinesterase
Ligand
BDBM50149201
Substrate
Meas. Tech.
ChEMBL_1775686 (CHEMBL4232678)
Kd
0.000±n/a nM
Citation
 Unver, MYGierse, RMRitchie, HHirsch, AKH Druggability Assessment of Targets Used in Kinetic Target-Guided Synthesis. J Med Chem 61:9395-9409 (2018)  
Target
Name:
Acetylcholinesterase
Synonyms:
ACES_ELEEL Acetylcholinesterase (EeAChE) | ache
Type:
Enzyme
Mol. Mass.:
71812.79
Organism:
Electrophorus electricus (Electric eel)
Description:
Residue:
633
  
Inhibitor
Name:
BDBM50149201
Synonyms:
3,8-DIAMINO-6-PHENYL-5-[6-[1-[2-[(1,2,3,4-TETRAHYDRO-9-ACRIDINYL)AMINO]ETHYL]-1H-1,2,3-TRIAZOL-5-YL]HEXYL]-PHENANTHRIDINIUM CHEMBL117651
Type:
Small organic molecule
Emp. Form.:
C42H45N8
Mol. Mass.:
661.8598
SMILES:
Nc1ccc2c(c1)c(-c1ccccc1)n(CCCCCCc1cnnn1CCNc1c3CCCCc3nc3ccccc13)c1cc(=[NH2+])ccc21
: