Target
Sterol O-acyltransferase 1
Ligand
BDBM50462665
Substrate
Meas. Tech.
ChEMBL_1776184 (CHEMBL4233176)
IC50
310±n/a nM
Citation
 Shibuya, KKawamine, KMiura, TOzaki, CEdano, TMizuno, KYoshinaka, YTsunenari, Y Design, synthesis and pharmacology of aortic-selective acyl-CoA: Cholesterol O-acyltransferase (ACAT/SOAT) inhibitors. Bioorg Med Chem 26:4001-4013 (2018)  
Target
Name:
Sterol O-acyltransferase 1
Synonyms:
ACAT-1 Acetoacetyl-CoA thiolase Acyl coenzyme A:cholesterol acyltransferase 1 Cholesterol acyltransferase 1 Soat1 | Sterol O-acyltransferase 1
Type:
PROTEIN
Mol. Mass.:
63818.83
Organism:
Mus musculus
Description:
ChEMBL_90523
Residue:
540
  
Inhibitor
Name:
BDBM50462665
Synonyms:
CHEMBL4248172
Type:
Small organic molecule
Emp. Form.:
C26H34N2O2S
Mol. Mass.:
438.625
SMILES:
CC(C)c1cccc(C(C)C)c1NC(=O)CCCCCCSc1nc2ccccc2o1
: