Target
Histone deacetylase 6
Ligand
BDBM50462728
Substrate
Meas. Tech.
ChEMBL_1776433 (CHEMBL4233425)
IC50
0.850000±n/a nM
Citation
 Yao, LRamanujulu, PMPoulsen, AOhlson, SDymock, BW Merging of ruxolitinib and vorinostat leads to highly potent inhibitors of JAK2 and histone deacetylase 6 (HDAC6). Bioorg Med Chem Lett 28:2636-2640 (2018)  
Target
Name:
Histone deacetylase 6
Synonyms:
Cereblon/Histone deacetylase 6 HDAC6 Histone deacetylase 6 (HDAC6) KIAA0901 | ORF Names:JM21
Type:
Chromatin regulator; hydrolase; repressor
Mol. Mass.:
131381.51
Organism:
Homo sapiens (Human)
Description:
Q9UBN7
Residue:
1215
  
Inhibitor
Name:
BDBM50462728
Synonyms:
CHEMBL4242626
Type:
Small organic molecule
Emp. Form.:
C26H29N9O3
Mol. Mass.:
515.567
SMILES:
ONC(=O)CCCCCCC(=O)Nc1ccc(Nc2nc(-c3cnn(CCC#N)c3)c3cc[nH]c3n2)cc1
: