Target
5'-AMP-activated protein kinase subunit beta-1
Ligand
BDBM237920
Substrate
Meas. Tech.
ChEMBL_1777636 (CHEMBL4234628)
IC50
400±n/a nM
Citation
 Ryder, TFCalabrese, MFWalker, GSCameron, KOReyes, ARBorzilleri, KADelmore, JMiller, RKurumbail, RGWard, JKung, DWBrown, JAEdmonds, DJEng, HWolford, ACKalgutkar, AS Acyl Glucuronide Metabolites of 6-Chloro-5-[4-(1-hydroxycyclobutyl)phenyl]-1 H-indole-3-carboxylic Acid (PF-06409577) and Related Indole-3-carboxylic Acid Derivatives are Direct Activators of Adenosine Monophosphate-Activated Protein Kinase (AMPK). J Med Chem 61:7273-7288 (2018)  
Target
Name:
5'-AMP-activated protein kinase subunit beta-1
Synonyms:
5'-AMP-activated protein kinase subunit beta-1 AMP-activated protein kinase alpha-2/beta-1/gamma-3 AMPK subunit beta-1 PRKAB1
Type:
Mol. Mass.:
30380.94
Organism:
Homo sapiens (Human)
Description:
Q9Y478
Residue:
270
  
Inhibitor
Name:
BDBM237920
Synonyms:
US9394285, 1
Type:
Small organic molecule
Emp. Form.:
C19H16ClNO3
Mol. Mass.:
341.788
SMILES:
OC(=O)c1c[nH]c2cc(Cl)c(cc12)-c1ccc(cc1)C1(O)CCC1
: