Target
Platelet-derived growth factor receptor beta
Ligand
BDBM50463510
Substrate
Meas. Tech.
ChEMBL_1778490 (CHEMBL4235482)
Kd
250±n/a nM
Citation
 Hudson, LMui, JVázquez, SCarvalho, DMWilliams, EJones, CBullock, ANHoelder, S Novel Quinazolinone Inhibitors of ALK2 Flip between Alternate Binding Modes: Structure-Activity Relationship, Structural Characterization, Kinase Profiling, and Cellular Proof of Concept. J Med Chem 61:7261-7272 (2018)  
Target
Name:
Platelet-derived growth factor receptor beta
Synonyms:
Beta-type platelet-derived growth factor receptor CD140b antigen PDGF Receptor Substrate PDGFR PDGFR-1 PDGFRB PGFRB_HUMAN Platelet-derived growth factor receptor 1 Platelet-derived growth factor receptor beta (PDGFR-beta) Platelet-derived growth factor receptor beta (PDGFRbeta) | VHL/PDGFRB
Type:
Enzyme
Mol. Mass.:
123922.25
Organism:
Homo sapiens (Human)
Description:
P09619
Residue:
1106
  
Inhibitor
Name:
BDBM50463510
Synonyms:
CHEMBL4244382
Type:
Small organic molecule
Emp. Form.:
C27H22N4O2
Mol. Mass.:
434.4892
SMILES:
O=c1n(cnc2ccc(cc12)-c1ccnc2ccccc12)-c1ccc(cc1)N1CCOCC1
: