Target
Platelet-derived growth factor receptor alpha
Ligand
BDBM50463510
Substrate
Meas. Tech.
ChEMBL_1778489 (CHEMBL4235481)
Kd
43±n/a nM
Citation
 Hudson, LMui, JVázquez, SCarvalho, DMWilliams, EJones, CBullock, ANHoelder, S Novel Quinazolinone Inhibitors of ALK2 Flip between Alternate Binding Modes: Structure-Activity Relationship, Structural Characterization, Kinase Profiling, and Cellular Proof of Concept. J Med Chem 61:7261-7272 (2018)  
Target
Name:
Platelet-derived growth factor receptor alpha
Synonyms:
Alpha-type platelet-derived growth factor receptor PDGFRA PGFRA_HUMAN Platelet-derived growth factor receptor alpha (PDGFRA) RHEPDGFRA
Type:
Protein
Mol. Mass.:
122633.38
Organism:
Homo sapiens (Human)
Description:
P16234
Residue:
1089
  
Inhibitor
Name:
BDBM50463510
Synonyms:
CHEMBL4244382
Type:
Small organic molecule
Emp. Form.:
C27H22N4O2
Mol. Mass.:
434.4892
SMILES:
O=c1n(cnc2ccc(cc12)-c1ccnc2ccccc12)-c1ccc(cc1)N1CCOCC1
: