Target
Serine/threonine-protein kinase B-raf
Ligand
BDBM50463507
Substrate
Meas. Tech.
ChEMBL_1778486 (CHEMBL4235478)
Kd
65±n/a nM
Citation
 Hudson, LMui, JVázquez, SCarvalho, DMWilliams, EJones, CBullock, ANHoelder, S Novel Quinazolinone Inhibitors of ALK2 Flip between Alternate Binding Modes: Structure-Activity Relationship, Structural Characterization, Kinase Profiling, and Cellular Proof of Concept. J Med Chem 61:7261-7272 (2018)  
Target
Name:
Serine/threonine-protein kinase B-raf
Synonyms:
B-RAF B-Raf proto-oncogene serine/threonine-protein kinase BRAF1 RAFB1 v-Raf murine sarcoma viral oncogene homolog B1
Type:
Serine/threonine-protein kinase
Mol. Mass.:
84446.00
Organism:
Homo sapiens (Human)
Description:
P15056
Residue:
766
  
Inhibitor
Name:
BDBM50463507
Synonyms:
CHEMBL4247751
Type:
Small organic molecule
Emp. Form.:
C19H15N3O
Mol. Mass.:
301.3419
SMILES:
Cc1nc2ccc(c(C)c2c(=O)[nH]1)-c1ccnc2ccccc12
: