Target
Activin receptor type-1
Ligand
BDBM50463515
Substrate
Meas. Tech.
ChEMBL_1778470 (CHEMBL4235462)
IC50
10.0±n/a nM
Citation
 Hudson, LMui, JVázquez, SCarvalho, DMWilliams, EJones, CBullock, ANHoelder, S Novel Quinazolinone Inhibitors of ALK2 Flip between Alternate Binding Modes: Structure-Activity Relationship, Structural Characterization, Kinase Profiling, and Cellular Proof of Concept. J Med Chem 61:7261-7272 (2018)  
Target
Name:
Activin receptor type-1
Synonyms:
2.7.11.30 ACVR1 ACVRLK2 ALK2/ACVR1 Activin receptor-like kinase 2 Activin receptor-like kinase 2 (ALK2/ACVR1) SKR1 TGF-B superfamily receptor type I | TSR-I
Type:
Mol. Mass.:
57158.32
Organism:
Homo sapiens (Human)
Description:
Residue:
509
  
Inhibitor
Name:
BDBM50463515
Synonyms:
CHEMBL4241942
Type:
Small organic molecule
Emp. Form.:
C20H16N2O
Mol. Mass.:
300.3538
SMILES:
Cc1cc2ccc(c(C)c2c(=O)[nH]1)-c1ccnc2ccccc12
: