Target
Histone deacetylase 1
Ligand
BDBM50463742
Substrate
Meas. Tech.
ChEMBL_1779290 (CHEMBL4236282)
Ki
0.580000±n/a nM
Citation
 Fournier, JFBhurruth-Alcor, YMusicki, BAubert, JAurelly, MBouix-Peter, CBouquet, KChantalat, LDelorme, MDrean, BDuvert, GFleury-Bregeot, NGauthier, BGrisendi, KHarris, CSHennequin, LFIsabet, TJoly, FLafitte, GMillois, CMorgentin, RPascau, JPiwnica, DRival, YSoulet, CThoreau, ÉTomas, L Squaramides as novel class I and IIB histone deacetylase inhibitors for topical treatment of cutaneous t-cell lymphoma. Bioorg Med Chem Lett 28:2985-2992 (2018)  
Target
Name:
Histone deacetylase 1
Synonyms:
Cereblon/Histone deacetylase 1 HDAC1 Histone deacetylase 1 (HDAC1) RPD3L1
Type:
Enzyme
Mol. Mass.:
55090.27
Organism:
Homo sapiens (Human)
Description:
Q13547
Residue:
482
  
Inhibitor
Name:
BDBM50463742
Synonyms:
CHEMBL4242292
Type:
Small organic molecule
Emp. Form.:
C18H20F3N3O5
Mol. Mass.:
415.3637
SMILES:
C[C@H](CCCCC(=O)NO)Nc1c(Nc2ccc(OC(F)(F)F)cc2)c(=O)c1=O
: