Target
Dual specificity protein kinase TTK
Ligand
BDBM50464040
Substrate
Meas. Tech.
ChEMBL_1779767 (CHEMBL4236759)
Ki
0.190000±n/a nM
Citation
 Woodward, HLInnocenti, PCheung, KJHayes, ARoberts, JHenley, ATFaisal, AMak, GWBox, GWestwood, IMCronin, NCarter, MValenti, MDe Haven Brandon, AO'Fee, LSaville, HSchmitt, JBurke, RBroccatelli, Fvan Montfort, RLMRaynaud, FIEccles, SALinardopoulos, SBlagg, JHoelder, S Introduction of a Methyl Group Curbs Metabolism of Pyrido[3,4- d]pyrimidine Monopolar Spindle 1 (MPS1) Inhibitors and Enables the Discovery of the Phase 1 Clinical Candidate N J Med Chem 61:8226-8240 (2018)  
Target
Name:
Dual specificity protein kinase TTK
Synonyms:
Dual specificity protein kinase (TTK) MPS1 Monopolar Spindle 1 (MPS1) Monopolar Spindle 1 Kinase (MPS1) TTK | TTK_HUMAN
Type:
Protein
Mol. Mass.:
97086.79
Organism:
Homo sapiens (Human)
Description:
P33981
Residue:
857
  
Inhibitor
Name:
BDBM50464040
Synonyms:
CHEMBL4251352
Type:
Small organic molecule
Emp. Form.:
C25H30N8O
Mol. Mass.:
458.5587
SMILES:
COc1cc(ccc1Nc1ncc2cc(C)nc(NCC(C)(C)C)c2n1)-c1nnc2CCCn12
: