Target
ATPase family AAA domain-containing protein 2
Ligand
BDBM50464132
Substrate
Meas. Tech.
ChEMBL_1780007 (CHEMBL4236999)
IC50
251±n/a nM
Citation
 Bamborough, PChung, CWFurze, RCGrandi, PMichon, AMWatson, RJMitchell, DJBarnett, HPrinjha, RKRau, CSheppard, RJWerner, TDemont, EH Aiming to Miss a Moving Target: Bromo and Extra Terminal Domain (BET) Selectivity in Constrained ATAD2 Inhibitors. J Med Chem 61:8321-8336 (2018)  
Target
Name:
ATPase family AAA domain-containing protein 2
Synonyms:
AAA nuclear coregulator cancer-associated protein ATAD2 PRO2000
Type:
PROTEIN
Mol. Mass.:
158546.30
Organism:
Homo sapiens (Human)
Description:
ChEMBL_1500426
Residue:
1390
  
Inhibitor
Name:
BDBM50464132
Synonyms:
CHEMBL4246286
Type:
Small organic molecule
Emp. Form.:
C29H37N5O3S
Mol. Mass.:
535.701
SMILES:
[H][C@]12CC[C@]([H])(N1)[C@@H](CCC1CCS(=O)(=O)CC1)[C@@H](C2)Nc1ncc(-c2cncc(C)c2)c2cc(C)c(=O)[nH]c12
: