Target
Adenosine receptor A2a
Ligand
BDBM50464762
Substrate
Meas. Tech.
ChEMBL_1782292 (CHEMBL4253809)
Ki
>10000±n/a nM
Citation
 Duroux, RAgouridas, LRenault, NEl Bakali, JFurman, CMelnyk, PYous, S Antagonists of the adenosine A Eur J Med Chem 144:151-163 (2018)  
Target
Name:
Adenosine receptor A2a
Synonyms:
A2A adenosine receptor (hA2A) ADENOSINE A2 ADORA2 Adenosine A2A receptor (A2AAR)
Type:
G Protein-Coupled Receptor (GPCR)
Mol. Mass.:
44716.46
Organism:
Homo sapiens (Human)
Description:
P29274
Residue:
412
  
Inhibitor
Name:
BDBM50464762
Synonyms:
CHEMBL4289393
Type:
Small organic molecule
Emp. Form.:
C32H34N4O6
Mol. Mass.:
570.6356
SMILES:
CCOCCOc1ccc(cc1)N1CCN(CCC(=O)Nc2cc(-c3ccco3)c3oc(nc3c2)-c2ccco2)CC1
: