Target
Mitogen-activated protein kinase kinase kinase 5
Ligand
BDBM50464985
Substrate
Meas. Tech.
ChEMBL_1783577 (CHEMBL4255094)
IC50
1.000000±n/a nM
Citation
 Lovering, FMorgan, PAllais, CAulabaugh, ABrodfuehrer, JChang, JCoe, JDing, WDowty, HFleming, MFrisbie, RGuzova, JHepworth, DJasti, JKortum, SKurumbail, RMohan, SPapaioannou, NStrohbach, JWVincent, FLee, KZapf, CW Rational approach to highly potent and selective apoptosis signal-regulating kinase 1 (ASK1) inhibitors. Eur J Med Chem 145:606-621 (2018)  
Target
Name:
Mitogen-activated protein kinase kinase kinase 5
Synonyms:
ASK1 MAP3K5 MEKK5
Type:
Protein
Mol. Mass.:
154514.93
Organism:
Homo sapiens (Human)
Description:
Q99683
Residue:
1374
  
Inhibitor
Name:
BDBM50464985
Synonyms:
CHEMBL4282644
Type:
Small organic molecule
Emp. Form.:
C19H20N6O3
Mol. Mass.:
380.4005
SMILES:
COc1ccc(cc1C(=O)Nc1cccc(n1)-c1nncn1C(C)C)C(N)=O
: