Target
4,4'-diapophytoene desaturase (4,4'-diaponeurosporene-forming)
Ligand
BDBM50465160
Substrate
Meas. Tech.
ChEMBL_1784290 (CHEMBL4255807)
IC50
5.3±n/a nM
Citation
 Ni, SLi, BChen, FWei, HMao, FLiu, YXu, YQiu, XLi, XLiu, WHu, LLing, DWang, MZheng, XZhu, JLan, LLi, J Novel Staphyloxanthin Inhibitors with Improved Potency against Multidrug Resistant  ACS Med Chem Lett 9:233-237 (2018)  
Target
Name:
4,4'-diapophytoene desaturase (4,4'-diaponeurosporene-forming)
Synonyms:
1.3.8.- Dehydrosqualene desaturase | crtN
Type:
PROTEIN
Mol. Mass.:
56702.79
Organism:
Staphylococcus aureus (strain MW2)
Description:
ChEMBL_116914
Residue:
502
  
Inhibitor
Name:
BDBM50465160
Synonyms:
CHEMBL4284707
Type:
Small organic molecule
Emp. Form.:
C24H25ClF3NO2
Mol. Mass.:
451.909
SMILES:
Cl.CN(C\C=C\C=C\C=C\c1ccc(cc1)C(F)(F)F)Cc1ccc2OCCOc2c1
: