Target
4,4'-diapophytoene desaturase (4,4'-diaponeurosporene-forming)
Ligand
BDBM50465164
Substrate
Meas. Tech.
ChEMBL_1784291 (CHEMBL4255808)
IC50
5.5±n/a nM
Citation
 Ni, SLi, BChen, FWei, HMao, FLiu, YXu, YQiu, XLi, XLiu, WHu, LLing, DWang, MZheng, XZhu, JLan, LLi, J Novel Staphyloxanthin Inhibitors with Improved Potency against Multidrug Resistant  ACS Med Chem Lett 9:233-237 (2018)  
Target
Name:
4,4'-diapophytoene desaturase (4,4'-diaponeurosporene-forming)
Synonyms:
1.3.8.- Dehydrosqualene desaturase | crtN
Type:
PROTEIN
Mol. Mass.:
56702.79
Organism:
Staphylococcus aureus (strain MW2)
Description:
ChEMBL_116914
Residue:
502
  
Inhibitor
Name:
BDBM50465164
Synonyms:
CHEMBL4288408
Type:
Small organic molecule
Emp. Form.:
C22H23ClF3NO2
Mol. Mass.:
425.872
SMILES:
Cl.CN(C\C=C\C=C\c1ccc(cc1)C(F)(F)F)Cc1ccc2OCCOc2c1
: