Target
3-oxoacyl-ACP synthase
Ligand
BDBM50465707
Substrate
Meas. Tech.
ChEMBL_1788588 (CHEMBL4260322)
IC50
1700±n/a nM
Citation
 Soukarieh, FWilliams, PStocks, MJCámara, M Pseudomonas aeruginosa Quorum Sensing Systems as Drug Discovery Targets: Current Position and Future Perspectives. J Med Chem 61:10385-10402 (2018)  
Target
Name:
3-oxoacyl-ACP synthase
Synonyms:
2-heptyl-4(1H)-quinolone synthase PqsD 3-oxoacyl-ACP synthase PA8380_44470 PQB biosynthetic 3-oxoacyl-[acyl-carrier-protein] synthase III pqsD
Type:
PROTEIN
Mol. Mass.:
36357.84
Organism:
Pseudomonas aeruginosa
Description:
ChEMBL_109728
Residue:
337
  
Inhibitor
Name:
BDBM50465707
Synonyms:
CHEMBL4292096
Type:
Small organic molecule
Emp. Form.:
C12H17N5O2S
Mol. Mass.:
295.361
SMILES:
CCCCCCS(=O)(=O)c1ncc(cn1)-n1ccnn1
: