Target
Non-receptor tyrosine-protein kinase TYK2
Ligand
BDBM412680
Substrate
Meas. Tech.
ChEMBL_1789535 (CHEMBL4261269)
IC50
8.4±n/a nM
Citation
 Elsayed, MSANielsen, JJPark, SPark, JLiu, QKim, CHPommier, YAgama, KLow, PSCushman, M Application of Sequential Palladium Catalysis for the Discovery of Janus Kinase Inhibitors in the Benzo[ c]pyrrolo[2,3- h][1,6]naphthyridin-5-one (BPN) Series. J Med Chem 61:10440-10462 (2018)  
Target
Name:
Non-receptor tyrosine-protein kinase TYK2
Synonyms:
Non-receptor tyrosine-protein kinase TYK2 (TYK2) TYK2_HUMAN | Tyrosine-protein kinase TYK2
Type:
Protein
Mol. Mass.:
133666.03
Organism:
Homo sapiens (Human)
Description:
P29597
Residue:
1187
  
Inhibitor
Name:
BDBM412680
Synonyms:
US10399979, Compound 17d
Type:
Small organic molecule
Emp. Form.:
C24H27N3O3
Mol. Mass.:
405.4895
SMILES:
COc1cc2c3cnc4[nH]ccc4c3n(C3CCCCCCC3)c(=O)c2cc1OC
: