Target
Progesterone receptor
Ligand
BDBM18660
Substrate
Meas. Tech.
ChEMBL_1791563 (CHEMBL4263482)
IC50
0.236000±n/a nM
Citation
 Sampathi Perera, KLIHanson, AMLindeman, SImhoff, ALu, XSem, DSDonaldson, WA Synthesis and evaluation of 4-cycloheptylphenols as selective Estrogen receptor-? agonists (SERBAs). Eur J Med Chem 157:791-804 (2018)  
Target
Name:
Progesterone receptor
Synonyms:
NR3C3 PGR PRGR_HUMAN | progesterone
Type:
Protein
Mol. Mass.:
98979.52
Organism:
Homo sapiens (Human)
Description:
P06401
Residue:
933
  
Inhibitor
Name:
BDBM18660
Synonyms:
(10S,11S,14S,15S)-14,15-dimethyl-14-propanoyltetracyclo[8.7.0.0^{2,7}.0^{11,15}]heptadeca-1,6-dien-5-one [3H]R5020
Type:
Small organic molecule
Emp. Form.:
C22H30O2
Mol. Mass.:
326.4724
SMILES:
[H][C@@]12CC[C@](C)(C(=O)CC)[C@@]1(C)CCC1=C3CCC(=O)C=C3CC[C@@]21[H]
: