Target
Neutrophil elastase
Ligand
BDBM50120437
Substrate
Meas. Tech.
ChEMBL_1793170 (CHEMBL4265089)
IC50
0.065000±n/a nM
Citation
 Crocetti, LGiovannoni, MPSchepetkin, IAQuinn, MTKhlebnikov, AICantini, NGuerrini, GIacovone, ATeodori, EVergelli, C 1H-pyrrolo[2,3-b]pyridine: A new scaffold for human neutrophil elastase (HNE) inhibitors. Bioorg Med Chem 26:5583-5595 (2018)  
Target
Name:
Neutrophil elastase
Synonyms:
Bone marrow serine protease Coagulation factor X ELANE Elastase HLE Leukocyte elastase Medullasin Neutrophil elastase (HNE) PMN elastase Trypsin
Type:
Enzyme
Mol. Mass.:
28532.38
Organism:
Homo sapiens (Human)
Description:
P08246
Residue:
267
  
Inhibitor
Name:
BDBM50120437
Synonyms:
CHEMBL3617973
Type:
Small organic molecule
Emp. Form.:
C22H17F3N4O3S
Mol. Mass.:
474.456
SMILES:
CN1[C@@H](C(C#N)=C(C)N(C1=O)c1cccc(c1)C(F)(F)F)c1ccc(cc1S(C)(=O)=O)C#N
: