Target
Adenosine receptor A1
Ligand
BDBM50020852
Substrate
Meas. Tech.
ChEBML_28519
IC50
1.8±n/a nM
Citation
 Hamilton, HWOrtwine, DFWorth, DFBristol, JA Synthesis and structure-activity relationships of pyrazolo[4,3-d]pyrimidin-7-ones as adenosine receptor antagonists. J Med Chem 30:91-6 (1987)  
Target
Name:
Adenosine receptor A1
Synonyms:
AA1R_RAT ADENOSINE A1 high Adenosine A1 receptor (A1) Adenosine receptors A1 | Adora1
Type:
Protein
Mol. Mass.:
36704.13
Organism:
Rattus norvegicus (rat)
Description:
Residue:
326
  
Inhibitor
Name:
BDBM50020852
Synonyms:
8-(4-Amino-phenyl)-1,3-dimethyl-3,7-dihydro-purine-2,6-dione CHEMBL276830
Type:
Small organic molecule
Emp. Form.:
C13H13N5O2
Mol. Mass.:
271.2746
SMILES:
Cn1c2nc([nH]c2c(=O)n(C)c1=O)-c1ccc(N)cc1
: