Target
Sialidase-2
Ligand
BDBM50330326
Substrate
Meas. Tech.
ChEMBL_1799826 (CHEMBL4272118)
Ki
5700±n/a nM
Citation
 Richards, MRGuo, THunter, CDCairo, CW Molecular dynamics simulations of viral neuraminidase inhibitors with the human neuraminidase enzymes: Insights into isoenzyme selectivity. Bioorg Med Chem 26:5349-5358 (2018)  
Target
Name:
Sialidase-2
Synonyms:
Cytosolic sialidase NEU2 Sialidase 2 | Sialidase-2
Type:
PROTEIN
Mol. Mass.:
42256.20
Organism:
Homo sapiens (Human)
Description:
ChEMBL_960638
Residue:
380
  
Inhibitor
Name:
BDBM50330326
Synonyms:
(4S,5R,6R)-5-Acetylamino-4-guanidino-6-((1R,3R)-1,2,3-trihydroxy-propyl)-5,6-dihydro-4H-pyran-2-carboxylic acid (4S,5R,6R)-5-Acetylamino-4-guanidino-6-(1,2,3-trihydroxy-propyl)-5,6-dihydro-4H-pyran-2-carboxylic acid (4S,5R,6R)-5-acetylamino-4-guanidino-6-((1R,2R)-1,2,3-trihydroxy-propy)-5,6-dihydro-4H-pyran-2-carboxylic acid 4-diaminomethylamino-3-methylcarboxamido-2-(1,2,3-trihydroxypropyl)-(3R)-3,4-dihydro-2H-6-pyrancarboxylic acid(Zanamivir) 5-Acetylamino-4-guanidino-6-(1,2,3-trihydroxy-propyl)-5,6-dihydro-4H-pyran-2-carboxylic acid(zanamivir) CHEMBL222813 Relenza | Zanamivi
Type:
Small organic molecule
Emp. Form.:
C12H20N4O7
Mol. Mass.:
332.3098
SMILES:
[#6]-[#6](=O)-[#7]-[#6@@H]-1-[#6@H](-[#6]=[#6](-[#8]-[#6@H]-1-[#6@H](-[#8])-[#6@H](-[#8])-[#6]-[#8])-[#6](-[#8])=O)\[#7]=[#6](\[#7])-[#7]
: