Target
Androgen receptor
Ligand
BDBM50425732
Substrate
Meas. Tech.
ChEMBL_1803387 (CHEMBL4275679)
IC50
50±n/a nM
Citation
 Dalal, KMorin, HBan, FShepherd, AFernandez, MTam, KJLi, HLeBlanc, ELack, NPrinz, HRennie, PSCherkasov, A Small molecule-induced degradation of the full length and V7 truncated variant forms of human androgen receptor. Eur J Med Chem 157:1164-1173 (2018)  
Target
Name:
Androgen receptor
Synonyms:
ANDR_HUMAN Androgen Receptor Androgen receptor/Baculoviral IAP repeat-containing protein 2 Dihydrotestosterone receptor Nuclear receptor subfamily 3 group C member 4
Type:
Receptor
Mol. Mass.:
99185.27
Organism:
Homo sapiens (Human)
Description:
CHO cells were stably transfected with human AR gene.
Residue:
920
  
Inhibitor
Name:
BDBM50425732
Synonyms:
ENZALUTAMIDE US10806720, Compound Enzalutamide US11648234, Compound Enzalutamide Xtandi
Type:
Small organic molecule
Emp. Form.:
C21H16F4N4O2S
Mol. Mass.:
464.436
SMILES:
CNC(=O)c1ccc(cc1F)N1C(=S)N(C(=O)C1(C)C)c1ccc(C#N)c(c1)C(F)(F)F
: