Target
Tyrosine-protein kinase Mer
Ligand
BDBM50469353
Substrate
Meas. Tech.
ChEMBL_1804040 (CHEMBL4276332)
Ki
0.430000±n/a nM
Citation
 Zhao, JZhang, DZhang, WStashko, MADeRyckere, DVasileiadi, EParker, REHunter, DLiu, QZhang, YNorris-Drouin, JLi, BDrewry, DHKireev, DGraham, DKEarp, HSFrye, SVWang, X Highly Selective MERTK Inhibitors Achieved by a Single Methyl Group. J Med Chem 61:10242-10254 (2018)  
Target
Name:
Tyrosine-protein kinase Mer
Synonyms:
MER MERTK Proto-oncogene c-Mer Receptor tyrosine kinase MerTK | Tyrosine-protein kinase Mer
Type:
PROTEIN
Mol. Mass.:
110234.77
Organism:
Homo sapiens (Human)
Description:
ChEMBL_1498723
Residue:
999
  
Inhibitor
Name:
BDBM50469353
Synonyms:
CHEMBL4283353
Type:
Small organic molecule
Emp. Form.:
C30H44N6O
Mol. Mass.:
504.71
SMILES:
CCC[C@H](C)Nc1ncc2c(cn([C@H]3CC[C@H](O)CC3)c2n1)-c1ccc(CN2CCCN(C)CC2)cc1
: