Target
Beta-lactamase
Ligand
BDBM50021959
Substrate
Meas. Tech.
ChEMBL_40881 (CHEMBL653635)
IC50
95400±n/a nM
Citation
  TBA Bioorg Med Chem Lett 4:1423-1428 (1994)    Article 
Target
Name:
Beta-lactamase
Synonyms:
BLAC_PROMI Carbenicillinase | blaP
Type:
PROTEIN
Mol. Mass.:
32766.94
Organism:
Proteus mirabilis
Description:
ChEMBL_101534
Residue:
298
  
Inhibitor
Name:
BDBM50021959
Synonyms:
CHEMBL777 US9120808, Clavulanic acid potassium salt clavulanic acid
Type:
Small organic molecule
Emp. Form.:
C8H9NO5
Mol. Mass.:
199.1608
SMILES:
OC\C=C1/O[C@@H]2CC(=O)N2[C@H]1C(O)=O
: