Target
Lysosomal alpha-glucosidase
Ligand
BDBM50478555
Substrate
Meas. Tech.
ChEMBL_483554 (CHEMBL961145)
IC50
531±n/a nM
Citation
 Nakao, YUehara, TMatsunaga, SFusetani, Nvan Soest, RWMatunaga, S Callyspongynic acid, a polyacetylenic acid which inhibits alpha-glucosidase, from the marine sponge Callyspongia truncata. J Nat Prod 65:922-4 (2002)  
Target
Name:
Lysosomal alpha-glucosidase
Synonyms:
70 kDa lysosomal alpha-glucosidase Acid maltase Alpha glucosidase LYAG_HUMAN
Type:
PROTEIN
Mol. Mass.:
105312.45
Organism:
Homo sapiens (Human)
Description:
ChEMBL_1506060
Residue:
952
  
Inhibitor
Name:
BDBM50478555
Synonyms:
Callyspongynic Acid
Type:
Small organic molecule
Emp. Form.:
C32H38O3
Mol. Mass.:
470.6423
SMILES:
O[C@@H](\C=C\CCCCCC#CC#CCCCC#CCCCC#CCCCCCC#CC(O)=O)C#C
: