Target
Type-1 angiotensin II receptor A/Type-1 angiotensin II receptor B/Type-2 angiotensin II receptor
Ligand
BDBM50469937
Substrate
Meas. Tech.
ChEMBL_36463 (CHEMBL653116)
Ki
0.125893±n/a nM
Citation
 Judd, DBDowle, MDMiddlemiss, DScopes, DIRoss, BCJack, TIPass, MTranquillini, EHobson, JEPanchal, TA Bromobenzofuran-based non-peptide antagonists of angiotensin II: GR138950, a potent antihypertensive agent with high oral bioavailability. J Med Chem 37:3108-20 (1994)  
Target
Name:
Type-1 angiotensin II receptor A/Type-1 angiotensin II receptor B/Type-2 angiotensin II receptor
Synonyms:
Angiotensin II receptor | Type-1A/Type-1B/Type-2 angiotensin II receptor
Type:
Mol. Mass.:
Description:
ASSAY_ID of ChEMBL is 36477
Components:
This complex has 3 components.
Component 1
Name:
Type-1 angiotensin II receptor B
Synonyms:
AGTRB_RAT Agtr1 Angiotensin II AT1B Angiotensin II type 1b (AT-1b) receptor Type-1B angiotensin II receptor
Type:
Enzyme Catalytic Domain
Mol. Mass.:
40929.44
Organism:
RAT
Description:
Angiotensin II AT1B 0 RAT::P29089
Residue:
359
  
Component 2
Name:
Type-2 angiotensin II receptor
Synonyms:
AGTR2_RAT Agtr2 Angiotensin II receptor Type-2 angiotensin II receptor
Type:
Enzyme Catalytic Domain
Mol. Mass.:
41346.62
Organism:
RAT
Description:
Angiotensin II AT2 0 0::P35351
Residue:
363
  
Component 3
Name:
Type-1 angiotensin II receptor A
Synonyms:
AGTRA_RAT Agtr1 Angiotensin II AT1 Angiotensin II receptor (AT-1) type-1 Type-1A angiotensin II receptor
Type:
Enzyme Catalytic Domain
Mol. Mass.:
40910.53
Organism:
RAT
Description:
ANGIOTENSIN AT1 AGTR1 RAT::P25095
Residue:
359
  
Inhibitor
Name:
BDBM50469937
Synonyms:
CHEMBL104493
Type:
Small organic molecule
Emp. Form.:
C29H30BrF3N4O4S
Mol. Mass.:
667.537
SMILES:
CCc1nc(C2CC2)c(C(=O)NCC(C)C)n1Cc1ccc2oc(c(Br)c2c1)-c1ccccc1NS(=O)(=O)C(F)(F)F
: