Target
cAMP-specific 3',5'-cyclic phosphodiesterase 4B
Ligand
BDBM50470736
Substrate
Meas. Tech.
ChEMBL_157199 (CHEMBL768612)
Ki
60±n/a nM
Citation
 Feldman, PLBrackeen, MFCowan, DJMarron, BESchoenen, FJStafford, JASuh, EMDomanico, PLRose, DLeesnitzer, MA Phosphodiesterase type IV inhibition. Structure-activity relationships of 1,3-disubstituted pyrrolidines. J Med Chem 38:1505-10 (1995)  
Target
Name:
cAMP-specific 3',5'-cyclic phosphodiesterase 4B
Synonyms:
3',5'-cyclic phosphodiesterase Isoform PDE4B1 PDE4B PDE4B_HUMAN Phosphodiesterase 4B (PDE4B) Phosphodiesterase Type 4 (PDE4B)
Type:
Protein
Mol. Mass.:
83318.87
Organism:
Homo sapiens (Human)
Description:
Q07343
Residue:
736
  
Inhibitor
Name:
BDBM50470736
Synonyms:
CHEMBL37029
Type:
Small organic molecule
Emp. Form.:
C24H29NO4
Mol. Mass.:
395.4914
SMILES:
COc1ccc(cc1OC1CCCC1)C1CCN(C1)C(=O)OCc1ccccc1
: