Target
5-hydroxytryptamine receptor 1A
Ligand
BDBM50036874
Substrate
Meas. Tech.
ChEMBL_1512 (CHEMBL616344)
Ki
0.199526±n/a nM
Citation
 Gaillard, PCarrupt, PATesta, BSchambel, P Binding of arylpiperazines, (aryloxy)propanolamines, and tetrahydropyridylindoles to the 5-HT1A receptor: contribution of the molecular lipophilicity potential to three-dimensional quantitative structure-affinity relationship models. J Med Chem 39:126-34 (1996)  
Target
Name:
5-hydroxytryptamine receptor 1A
Synonyms:
5-HT-1A 5-HT1A 5-hydroxytryptamine receptor 1A (5HT1A) 5ht1a Htr1a Serotonin 1a (5-HT1a) receptor/Adrenergic receptor alpha-1 | Serotonin receptor 1A
Type:
G Protein-Coupled Receptor (GPCR)
Mol. Mass.:
46445.29
Organism:
Rattus norvegicus (rat)
Description:
Binding assays were performed using rat hippocampal membranes.
Residue:
422
  
Inhibitor
Name:
BDBM50036874
Synonyms:
4-Fluoro-N-{4-[(5-methoxy-chroman-3-yl)-propyl-amino]-butyl}-benzamide; compound with oxalic acid | CHEMBL298534
Type:
Small organic molecule
Emp. Form.:
C24H31FN2O3
Mol. Mass.:
414.5129
SMILES:
CCCN(CCCCNC(=O)c1ccc(F)cc1)C1COc2cccc(OC)c2C1
: