Target
Alpha-1A/Alpha-1B/Alpha-1D adrenergic receptor
Ligand
BDBM50036910
Substrate
Meas. Tech.
ChEMBL_33708 (CHEMBL647531)
EC50
153±n/a nM
Citation
 Zhang, XYao, XTDalton, JTShams, GLei, LPatil, PNFeller, DRHsu, FLGeorge, CMiller, DD Medetomidine analogs as alpha 2-adrenergic ligands. 2. Design, synthesis, and biological activity of conformationally restricted naphthalene derivatives of medetomidine. J Med Chem 39:3001-13 (1996)  
Target
Name:
Alpha-1A/Alpha-1B/Alpha-1D adrenergic receptor
Synonyms:
Adrenergic receptor alpha-1 alpha-1 Adrenergic Receptor
Type:
Mol. Mass.:
Description:
ASSAY_ID of EBI is 303470
Components:
This complex has 3 components.
Component 1
Name:
Alpha-1B adrenergic receptor
Synonyms:
ADA1B_RAT Alpha 1B-adrenoceptor Alpha adrenergic receptor 1A and 1B Alpha-1Adrenoceptor Alpha-1B adrenoreceptor | adrenergic Alpha1B
Type:
G Protein-Coupled Receptor (GPCR)
Mol. Mass.:
56606.71
Organism:
Rattus norvegicus (rat)
Description:
Receptor binding assays were performed using rat cortical membranes.
Residue:
515
  
Component 2
Name:
Alpha-1A adrenergic receptor
Synonyms:
ADA1A_RAT Adra1c Alpha-1A adrenoceptor Alpha-1C adrenergic receptor | adrenergic Alpha1A
Type:
Protein
Mol. Mass.:
51620.15
Organism:
Rattus norvegicus (Rat)
Description:
P43140
Residue:
466
  
Component 3
Name:
Alpha-1D adrenergic receptor
Synonyms:
ADA1D_RAT Adra1d Alpha-1D adrenergic receptor | Serotonin 1a (5-HT1a) receptor/Adrenergic receptor alpha-1
Type:
Protein
Mol. Mass.:
59375.97
Organism:
Rattus norvegicus (Rat)
Description:
P23944
Residue:
561
  
Inhibitor
Name:
BDBM50036910
Synonyms:
4-(1-Naphthalen-1-yl-ethyl)-1H-imidazole | CHEMBL306751
Type:
Small organic molecule
Emp. Form.:
C15H14N2
Mol. Mass.:
222.2851
SMILES:
CC(c1cnc[nH]1)c1cccc2ccccc12
: