Target
Alpha-1D adrenergic receptor
Ligand
BDBM50403649
Substrate
Meas. Tech.
ChEMBL_32870 (CHEMBL648010)
Ki
0.575440±n/a nM
Citation
 Giardinà, DCrucianelli, MRomanelli, RLeonardi, APoggesi, EMelchiorre, C Synthesis and biological profile of the enantiomers of [4-(4-amino-6,7-dimethoxyquinazolin-2-yl)-cis-octahydroquinoxalin- 1-yl]furan-2-ylmethanone (cyclazosin), a potent competitive alpha 1B- adrenoceptor antagonist. J Med Chem 39:4602-7 (1996)  
Target
Name:
Alpha-1D adrenergic receptor
Synonyms:
ADA1D_RAT Adra1d Alpha-1D adrenergic receptor | Serotonin 1a (5-HT1a) receptor/Adrenergic receptor alpha-1
Type:
Protein
Mol. Mass.:
59375.97
Organism:
Rattus norvegicus (Rat)
Description:
P23944
Residue:
561
  
Inhibitor
Name:
BDBM50403649
Synonyms:
CYCLAZOSIN
Type:
Small organic molecule
Emp. Form.:
C23H27N5O4
Mol. Mass.:
437.4916
SMILES:
COc1cc2nc(nc(N)c2cc1OC)N1CCN([C@H]2CCCC[C@@H]12)C(=O)c1ccco1
: