Target
5-hydroxytryptamine receptor 2C
Ligand
BDBM50471324
Substrate
Meas. Tech.
ChEMBL_2746 (CHEMBL617508)
Ki
0.398107±n/a nM
Citation
 Bös, MJenck, FMartin, JRMoreau, JLSleight, AJWichmann, JWidmer, U Novel agonists of 5HT2C receptors. Synthesis and biological evaluation of substituted 2-(indol-1-yl)-1-methylethylamines and 2-(indeno[1,2-b]pyrrol-1-yl)-1-methylethylamines. Improved therapeutics for obsessive compulsive disorder. J Med Chem 40:2762-9 (1997)  
Target
Name:
5-hydroxytryptamine receptor 2C
Synonyms:
5-HT-2C 5-HT2C-INI 5-HTR2C 5-hydroxytryptamine receptor 2C (5-HT-2C) 5HT-1C HTR1C Serotonin (5-HT3) receptor Serotonin Receptor 2C
Type:
G Protein-Coupled Receptor (GPCR)
Mol. Mass.:
51836.79
Organism:
Homo sapiens (Human)
Description:
P28335
Residue:
458
  
Inhibitor
Name:
BDBM50471324
Synonyms:
CHEMBL318639
Type:
Small organic molecule
Emp. Form.:
C17H22N2O
Mol. Mass.:
270.3694
SMILES:
COc1ccc2c(c1)-c1c(ccn1CC(C)N)C2(C)C
: