Target
Sporulation kinase A
Ligand
BDBM50065970
Substrate
Meas. Tech.
ChEMBL_37761 (CHEMBL650776)
IC50
21000±n/a nM
Citation
 Macielag, MJDemers, JPFraga-Spano, SAHlasta, DJJohnson, SGKanojia, RMRussell, RKSui, ZWeidner-Wells, MAWerblood, HFoleno, BDGoldschmidt, RMLoeloff, MJWebb, GCBarrett, JF Substituted salicylanilides as inhibitors of two-component regulatory systems in bacteria. J Med Chem 41:2939-45 (1998)  
Target
Name:
Sporulation kinase A
Synonyms:
KINA_BACSU Stage II sporulation protein F gsiC scoD spoIIJ
Type:
PROTEIN
Mol. Mass.:
69161.05
Organism:
Bacillus subtilis (strain 168)
Description:
ChEMBL_105028
Residue:
606
  
Inhibitor
Name:
BDBM50065970
Synonyms:
CHEMBL57656 N-(3,4-dichlorophenyl)-2-hydroxy-3,5-diiodobenzamide
Type:
Small organic molecule
Emp. Form.:
C13H7Cl2I2NO2
Mol. Mass.:
533.915
SMILES:
Oc1c(I)cc(I)cc1C(=O)Nc1ccc(Cl)c(Cl)c1
: