Target
Muscarinic acetylcholine receptor M2
Ligand
BDBM50241132
Substrate
Meas. Tech.
ChEMBL_138173 (CHEMBL748235)
Ki
0.158±n/a nM
Citation
 Xu, RSim, MKGo, ML Synthesis and pharmacological characterization of O-alkynyloximes of tropinone and N-methylpiperidinone as muscarinic agonists. J Med Chem 41:3220-31 (1998)  
Target
Name:
Muscarinic acetylcholine receptor M2
Synonyms:
ACM2_RAT Chrm-2 | Chrm2
Type:
Enzyme Catalytic Domain
Mol. Mass.:
51555.53
Organism:
RAT
Description:
P10980
Residue:
466
  
Inhibitor
Name:
BDBM50241132
Synonyms:
3-Hydroxy-2-phenyl-propionic acid 9-methyl-3-oxa-9-aza-tricyclo[3.3.1.0*2,4*]non-7-yl ester CHEMBL376897 Methyl scopolamine | N-METHYLSCOPOLAMINE
Type:
Small organic molecule
Emp. Form.:
C18H24NO4
Mol. Mass.:
318.3869
SMILES:
C[N+]1(C)[C@H]2C[C@@H](C[C@@H]1[C@H]1O[C@@H]21)OC(=O)[C@H](CO)c1ccccc1
: