Target
Similar to alpha-tubulin isoform 1
Ligand
BDBM50472206
Substrate
Meas. Tech.
ChEMBL_211358 (CHEMBL815874)
IC50
3300±n/a nM
Citation
 Xia, YYang, ZYXia, PBastow, KFTachibana, YKuo, SCHamel, EHackl, TLee, KH Antitumor agents. 181. Synthesis and biological evaluation of 6,7,2',3',4'-substituted-1,2,3,4-tetrahydro-2-phenyl-4-quinolones as a new class of antimitotic antitumor agents. J Med Chem 41:1155-62 (1998)  
Target
Name:
Similar to alpha-tubulin isoform 1
Synonyms:
Similar to alpha-tubulin isoform 1
Type:
PROTEIN
Mol. Mass.:
10383.05
Organism:
Bos taurus
Description:
ChEMBL_104716
Residue:
99
  
Inhibitor
Name:
BDBM50472206
Synonyms:
CHEMBL274468
Type:
Small organic molecule
Emp. Form.:
C16H15NO2
Mol. Mass.:
253.2958
SMILES:
COc1cccc(c1)C1CC(=O)c2ccccc2N1
: