Target
5-hydroxytryptamine receptor 1A
Ligand
BDBM50472566
Substrate
Meas. Tech.
ChEMBL_1514 (CHEMBL616346)
Ki
0.120226±n/a nM
Citation
 Vacher, BBonnaud, BFunes, PJubault, NKoek, WAssié, MBCosi, CKleven, M Novel derivatives of 2-pyridinemethylamine as selective, potent, and orally active agonists at 5-HT1A receptors. J Med Chem 42:1648-60 (1999)  
Target
Name:
5-hydroxytryptamine receptor 1A
Synonyms:
5-HT-1A 5-HT1A 5-hydroxytryptamine receptor 1A (5HT1A) 5ht1a Htr1a Serotonin 1a (5-HT1a) receptor/Adrenergic receptor alpha-1 | Serotonin receptor 1A
Type:
G Protein-Coupled Receptor (GPCR)
Mol. Mass.:
46445.29
Organism:
Rattus norvegicus (rat)
Description:
Binding assays were performed using rat hippocampal membranes.
Residue:
422
  
Inhibitor
Name:
BDBM50472566
Synonyms:
CHEMBL360319
Type:
Small organic molecule
Emp. Form.:
C21H25ClF2N4O
Mol. Mass.:
422.899
SMILES:
CN(C)c1cccc(CNCC2(F)CCN(CC2)C(=O)c2ccc(F)c(Cl)c2)n1
: