Target
Alpha-2C adrenergic receptor
Ligand
BDBM50473229
Substrate
Meas. Tech.
ChEMBL_33812 (CHEMBL647196)
EC50
14±n/a nM
Citation
 Wong, WCSun, WCui, WChen, YForray, CVaysse, PJBranchek, TAGluchowski, C 2-amino-2-oxazolines as subtype selective alpha(2) adrenoceptor agonists. J Med Chem 43:1699-704 (2000)  
Target
Name:
Alpha-2C adrenergic receptor
Synonyms:
ADA2C_HUMAN ADRA2L2 Adrenergic alpha2C Adrenergic receptor alpha Alpha-2 adrenergic receptor subtype C4 Alpha-2C adrenoreceptor | adrenergic, alpha-2C-, receptor [Homo sapiens]
Type:
Enzyme
Mol. Mass.:
49552.32
Organism:
Homo sapiens (Human)
Description:
P18825
Residue:
462
  
Inhibitor
Name:
BDBM50473229
Synonyms:
CHEMBL295186
Type:
Small organic molecule
Emp. Form.:
C17H22N2O
Mol. Mass.:
270.3694
SMILES:
C([C@H]1C2CCC(C2)[C@H]1NC1=NCCO1)c1ccccc1
: