Target
Alpha-2A adrenergic receptor
Ligand
BDBM50473226
Substrate
Meas. Tech.
ChEMBL_33794 (CHEMBL648119)
EC50
71±n/a nM
Citation
 Wong, WCSun, WCui, WChen, YForray, CVaysse, PJBranchek, TAGluchowski, C 2-amino-2-oxazolines as subtype selective alpha(2) adrenoceptor agonists. J Med Chem 43:1699-704 (2000)  
Target
Name:
Alpha-2A adrenergic receptor
Synonyms:
ADA2A_HUMAN ADRA2R Adrenergic alpha2A Alpha-2 adrenergic receptor subtype C10 Alpha-2A adrenoreceptor alpha-2A adrenergic receptor [Homo sapiens]
Type:
Enzyme
Mol. Mass.:
48979.91
Organism:
Homo sapiens (Human)
Description:
P08913
Residue:
450
  
Inhibitor
Name:
BDBM50473226
Synonyms:
CHEMBL297827
Type:
Small organic molecule
Emp. Form.:
C19H24N2O
Mol. Mass.:
296.4067
SMILES:
C(\C=C\c1ccccc1)[C@H]1C2CCC(C2)[C@H]1NC1=NCCO1
: