Target
Alpha-2A adrenergic receptor
Ligand
BDBM50335519
Substrate
Meas. Tech.
ChEMBL_33479 (CHEMBL649810)
Ki
50±n/a nM
Citation
 Cordi, AABerque-Bestel, IPersigand, TLacoste, JMNewman-Tancredi, AAudinot, VMillan, MJ Potential antidepressants displayed combined alpha(2)-adrenoceptor antagonist and monoamine uptake inhibitor properties. J Med Chem 44:787-805 (2001)  
Target
Name:
Alpha-2A adrenergic receptor
Synonyms:
ADA2A_HUMAN ADRA2R Adrenergic alpha2A Alpha-2 adrenergic receptor subtype C10 Alpha-2A adrenoreceptor alpha-2A adrenergic receptor [Homo sapiens]
Type:
Enzyme
Mol. Mass.:
48979.91
Organism:
Homo sapiens (Human)
Description:
P08913
Residue:
450
  
Inhibitor
Name:
BDBM50335519
Synonyms:
(S)-3,6-Diamino-hexanoic acid {(3S,9S,12S,15S)-3-((S)-6-hydroxy-2-imino-hexahydro-pyrimidin-4-yl)-9,12-bis-hydroxymethyl-2,5,8,11,14-pentaoxo-6-[1-ureido-meth-(Z)-ylidene]-1,4,7,10,13pentaaza-cyclohexadec-15-yl}-amide CHEMBL262777 Glycopeptide antibiotic Mannopeptimycin glycopeptide analogue Poly ethylene glycol derivative Vancocin Vancor vancomycin | vanomycin
Type:
Small organic molecule
Emp. Form.:
C66H75Cl2N9O24
Mol. Mass.:
1449.254
SMILES:
CN[C@H](CC(C)C)C(=O)N[C@@H]1[C@H](O)c2ccc(Oc3cc4cc(Oc5ccc(cc5Cl)[C@@H](O)[C@@H]5NC(=O)[C@H](NC(=O)[C@@H]4NC(=O)[C@H](CC(N)=O)NC1=O)c1ccc(O)c(c1)-c1c(O)cc(O)cc1[C@H](NC5=O)C(O)=O)c3O[C@@H]1O[C@H](CO)[C@@H](O)[C@H](O)[C@H]1O[C@H]1C[C@](C)(N)[C@H](O)[C@H](C)O1)c(Cl)c2
: