Target
Alpha-2A adrenergic receptor
Ligand
BDBM50421580
Substrate
Meas. Tech.
ChEMBL_33086 (CHEMBL643578)
EC50
40±n/a nM
Citation
 Hodson, SJBishop, MJSpeake, JDNavas, FGarrison, DTBigham, ECSaussy, DLLiacos, JAIrving, PEGobel, MJSherman, BW 2-(Anilinomethyl)imidazolines as alpha1 adrenergic receptor agonists: the discovery of alpha1a subtype selective 2'-alkylsulfonyl-substituted analogues. J Med Chem 45:2229-39 (2002)  
Target
Name:
Alpha-2A adrenergic receptor
Synonyms:
ADA2A_HUMAN ADRA2R Adrenergic alpha2A Alpha-2 adrenergic receptor subtype C10 Alpha-2A adrenoreceptor alpha-2A adrenergic receptor [Homo sapiens]
Type:
Enzyme
Mol. Mass.:
48979.91
Organism:
Homo sapiens (Human)
Description:
P08913
Residue:
450
  
Inhibitor
Name:
BDBM50421580
Synonyms:
CHEMBL117248
Type:
Small organic molecule
Emp. Form.:
C11H15N3S
Mol. Mass.:
221.322
SMILES:
CSc1ccccc1NCC1=NCCN1
: