Target
D(3) dopamine receptor
Ligand
BDBM50474402
Substrate
Meas. Tech.
ChEMBL_62595 (CHEMBL674272)
Ki
4.0±n/a nM
Citation
 Macdonald, GJBranch, CLHadley, MSJohnson, CNNash, DJSmith, ABStemp, GThewlis, KMVong, AKAustin, NEJeffrey, PWinborn, KYBoyfield, IHagan, JJMiddlemiss, DNReavill, CRiley, GJWatson, JMWood, MParker, SGAshby, CR Design and synthesis of trans-3-(2-(4-((3-(3-(5-methyl-1,2,4-oxadiazolyl))- phenyl)carboxamido)cyclohexyl)ethyl)-7-methylsulfonyl-2,3,4,5-tetrahydro-1H-3-benzazepine (SB-414796): a potent and selective dopamine D3 receptor antagonist. J Med Chem 46:4952-64 (2003)  
Target
Name:
D(3) dopamine receptor
Synonyms:
DOPAMINE D3 DRD3_HUMAN Dopamine D3 receptor (D3) Dopamine receptor Dopamine receptor D3
Type:
Mol. Mass.:
44243.43
Organism:
Homo sapiens (Human)
Description:
Residue:
400
  
Inhibitor
Name:
BDBM50474402
Synonyms:
CHEMBL3084615
Type:
Small organic molecule
Emp. Form.:
C30H38ClN3O4S
Mol. Mass.:
572.158
SMILES:
Cl.Cc1cc(on1)-c1cccc(c1)C(=O)N[C@H]1CC[C@H](CCN2CCc3ccc(cc3CC2)S(C)(=O)=O)CC1
: